Reaction Details
TargetMitogen-activated protein kinase 14
LigandBDBM50122384
Substrate/Competitorn/a
Meas. Tech.ChEBML_124486
IC50 0.200000±n/a nM
Citation Stelmach, JELiu, LPatel, SBPivnichny, JVScapin, GSingh, SHop, CEWang, ZStrauss, JRCameron, PMNichols, EAO'Keefe, SJO'Neill, EASchmatz, DMSchwartz, CDThompson, CMZaller, DMDoherty, JB Design and synthesis of potent, orally bioavailable dihydroquinazolinone inhibitors of p38 MAP kinase. Bioorg Med Chem Lett13:277-80 (2002) Mitogen-activated protein kinase 14
Name:Mitogen-activated protein kinase 14
Type:Serine/threonine-protein kinase
Mol. Mass.:41286.76
Organism:Homo sapiens (Human)
Description:Q16539
Residue:360
BDBM50122384
NameBDBM50122384
Synonyms:5-(2-Chloro-phenyl)-1-(2,6-dichloro-phenyl)-7-(piperidin-4-yloxy)-3,4-dihydro-1H-quinazolin-2-one CHEMBL94825
TypeSmall organic molecule
Emp. Form.C25H22Cl3N3O2
Mol. Mass.502.82
SMILESClc1ccccc1-c1cc(OC2CCNCC2)cc2N(C(=O)NCc12)c1c(Cl)cccc1Cl