Reaction Details
TargetGlutamate receptor ionotropic, NMDA 1
LigandBDBM50122596
Substrate/Competitorn/a
Meas. Tech.ChEMBL_141417 (CHEMBL752321)
Ki 120±n/a nM
Citation Jansen, MPotschka, HBrandt, CLöscher, WDannhardt, G Hydantoin-substituted 4,6-dichloroindole-2-carboxylic acids as ligands with high affinity for the glycine binding site of the NMDA receptor. J Med Chem46:64-73 (2002) 
 
Glutamate receptor ionotropic, NMDA 1
Name:Glutamate receptor ionotropic, NMDA 1
Type:Enzyme Catalytic Domain
Mol. Mass.:105397.81
Organism:Homo sapiens (Human)
Description:Q05586
Residue:938
BDBM50122596
NameBDBM50122596
Synonyms:3-(Benzoylamino-methyl)-4,6-dichloro-1H-indole-2-carboxylic acid | CHEMBL163916
TypeSmall organic molecule
Emp. Form.C17H12Cl2N2O3
Mol. Mass.363.195
SMILESOC(=O)c1[nH]c2cc(Cl)cc(Cl)c2c1CNC(=O)c1ccccc1