Reaction Details
TargetPurine nucleoside phosphorylase
LigandBDBM50122724
Substrate/Competitorn/a
Meas. Tech.ChEMBL_162004 (CHEMBL764175)
Ki 0.06±n/a nM
Citation Evans, GBFurneaux, RHGainsford, GJHanson, JCKicska, GASauve, AASchramm, VLTyler, PC 8-Aza-immucillins as transition-state analogue inhibitors of purine nucleoside phosphorylase and nucleoside hydrolases. J Med Chem46:155-60 (2002) 
 
Purine nucleoside phosphorylase
Name:Purine nucleoside phosphorylase
Type:Enzyme
Mol. Mass.:32035.18
Organism:Bos taurus (bovine)
Description:n/a
Residue:289
BDBM50122724
NameBDBM50122724
Synonyms:4-Amino-5-(3,4-dihydroxy-5-hydroxymethyl-pyrrolidin-2-yl)-2H-pyrazole-3-carboxylic acid amide | CHEMBL41949
TypeSmall organic molecule
Emp. Form.C9H15N5O4
Mol. Mass.257.2465
SMILESNC(=O)c1[nH]nc(C2N[C@H](CO)[C@H](O)[C@@H]2O)c1N