Reaction Details
TargetPurine nucleoside phosphorylase
LigandBDBM50422435
Substrate/Competitorn/a
Meas. Tech.ChEMBL_162004 (CHEMBL764175)
Ki 0.042000±n/a nM
Citation Evans, GBFurneaux, RHGainsford, GJHanson, JCKicska, GASauve, AASchramm, VLTyler, PC 8-Aza-immucillins as transition-state analogue inhibitors of purine nucleoside phosphorylase and nucleoside hydrolases. J Med Chem46:155-60 (2002) 
 
Purine nucleoside phosphorylase
Name:Purine nucleoside phosphorylase
Type:Enzyme
Mol. Mass.:32035.18
Organism:Bos taurus (bovine)
Description:n/a
Residue:289
BDBM50422435
NameBDBM50422435
Synonyms:CHEMBL2311112
TypeSmall organic molecule
Emp. Form.C10H13N5O4
Mol. Mass.267.2413
SMILESOC[C@H]1N[C@H]([C@H](O)[C@@H]1O)c1[nH]nc2c1nc[nH]c2=O