Reaction Details
TargetMetabotropic glutamate receptor 5
LigandBDBM50122759
Substrate/Competitorn/a
Meas. Tech.ChEMBL_104294 (CHEMBL857622)
Ki 6±n/a nM
Citation Cosford, NDTehrani, LRoppe, JSchweiger, ESmith, NDAnderson, JBristow, LBrodkin, JJiang, XMcDonald, IRao, SWashburn, MVarney, MA 3-[(2-Methyl-1,3-thiazol-4-yl)ethynyl]-pyridine: a potent and highly selective metabotropic glutamate subtype 5 receptor antagonist with anxiolytic activity. J Med Chem46:204-6 (2003) 
 
Metabotropic glutamate receptor 5
Name:Metabotropic glutamate receptor 5
Type:Enzyme
Mol. Mass.:131900.14
Organism:Rattus norvegicus (Rat)
Description:P31424
Residue:1203
BDBM50122759
NameBDBM50122759
Synonyms:2-Methyl-4-phenylethynyl-thiazole | CHEMBL63042
TypeSmall organic molecule
Emp. Form.C12H9NS
Mol. Mass.199.272
SMILESCc1nc(cs1)C#Cc1ccccc1