Reaction Details
TargetThymidine phosphorylase
LigandBDBM50122771
Substrate/Competitorn/a
Meas. Tech.ChEMBL_210622 (CHEMBL811739)
IC50 21±n/a nM
Citation Cole, CReigan, PGbaj, AEdwards, PNDouglas, KTStratford, IJFreeman, SJaffar, M Potential tumor-selective nitroimidazolylmethyluracil prodrug derivatives: inhibitors of the angiogenic enzyme thymidine phosphorylase. J Med Chem46:207-9 (2003) 
 
Thymidine phosphorylase
Name:Thymidine phosphorylase
Type:Enzyme
Mol. Mass.:49948.87
Organism:Homo sapiens (Human)
Description:The recombinant human thymidine phosphorylase (V79TP) was expressed in V79 Chinese hamster cells (Sigma, T-9319).
Residue:482
BDBM50122771
NameBDBM50122771
Synonyms:2-Amino-1-(5-chloro-2,6-dioxo-1,2,3,6-tetrahydro-pyrimidin-4-ylmethyl)-3H-imidazol-1-ium; chloride CHEMBL66531
TypeSmall organic molecule
Emp. Form.C8H9ClN5O2
Mol. Mass.242.642
SMILESNc1[nH+]ccn1Cc1[nH]c(=O)[nH]c(=O)c1Cl