Reaction Details
TargetCarnitine O-palmitoyltransferase 1, muscle isoform
LigandBDBM50122836
Substrate/Competitorn/a
Meas. Tech.ChEMBL_46329 (CHEMBL874517)
IC50 167400±n/a nM
Citation Giannessi, FPessotto, PTassoni, EChiodi, PConti, RDe Angelis, FDell'Uomo, NCatini, RDeias, RTinti, MOCarminati, PArduini, A Discovery of a long-chain carbamoyl aminocarnitine derivative, a reversible carnitine palmitoyltransferase inhibitor with antiketotic and antidiabetic activity. J Med Chem46:303-9 (2003) 
 
Carnitine O-palmitoyltransferase 1, muscle isoform
Name:Carnitine O-palmitoyltransferase 1, muscle isoform
Type:PROTEIN
Mol. Mass.:88241.28
Organism:Rattus norvegicus
Description:ChEMBL_887447
Residue:772
BDBM50122836
NameBDBM50122836
Synonyms:CHEMBL102993 | [3-Carboxy-2-(3-tetradecyl-ureido)-propyl]-trimethyl-ammonium
TypeSmall organic molecule
Emp. Form.C22H45N3O3
Mol. Mass.399.611
(=O)N[C@@H](CC([O-])=O)C[N+](C)(C)C