Reaction Details
TargetGenome polyprotein
LigandBDBM50122882
Substrate/Competitorn/a
Meas. Tech.ChEMBL_143626 (CHEMBL751834)
Ki 8300±n/a nM
Citation Colarusso, SKoch, UGerlach, BSteinkühler, CDe Francesco, RAltamura, SMatassa, VGNarjes, F Phenethyl amides as novel noncovalent inhibitors of hepatitis C virus NS3/4A protease: discovery, initial SAR, and molecular modeling. J Med Chem46:345-8 (2003) 
 
Genome polyprotein
Name:Genome polyprotein
Type:Protein
Mol. Mass.:67067.41
Organism:Hepatitis C virus
Description:A3EZI9
Residue:631
BDBM50122882
NameBDBM50122882
Synonyms:4-(1-{1-[2-(2-Chloro-phenyl)-ethylcarbamoyl]-2-mercapto-ethylcarbamoyl}-3-methyl-butylcarbamoyl)-4-isobutoxycarbonylamino-butyric acid | CHEMBL117815
TypeSmall organic molecule
Emp. Form.C28H41ClF2N4O7
Mol. Mass.619.098
SMILESCC(C)C[C@H](NC(=O)C(CCC(O)=O)NC(=O)OC(C)(C)C)C(=O)NC(CC(F)F)C(=O)NCCc1ccccc1Cl