Reaction Details
TargetGenome polyprotein/Non-structural protein 4A
LigandBDBM50122902
Substrate/Competitorn/a
Meas. Tech.ChEMBL_158776 (CHEMBL772933)
IC50 4±n/a nM
Citation Colarusso, SKoch, UGerlach, BSteinkühler, CDe Francesco, RAltamura, SMatassa, VGNarjes, F Phenethyl amides as novel noncovalent inhibitors of hepatitis C virus NS3/4A protease: discovery, initial SAR, and molecular modeling. J Med Chem46:345-8 (2003) 
 
Genome polyprotein/Non-structural protein 4A
Name:Genome polyprotein/Non-structural protein 4A
Synonyms:Hepatitis C virus serine protease, NS3/NS4A
Type:n/a
Mol. Mass.:n/a
Description:ASSAY_ID of ChEMBL is 1969955
Components:This complex has 2 components.
Component 1
Name:Non-structural protein 4A
Type:PROTEIN
Mol. Mass.:5762.65
Organism:Hepatitis C virus
Description:ChEMBL_305334
Residue:54
Component 2
Name:Genome polyprotein
Synonyms:Hepatitis C virus NS3 protease/helicase | Hepatitis C virus serine protease, NS3/NS4A
Type:Protein
Mol. Mass.:67067.41
Organism:Hepatitis C virus
Description:A3EZI9
Residue:631
BDBM50122902
NameBDBM50122902
Synonyms:4-(2-Acetylamino-3-carboxy-propionylamino)-4-(1-{1-[2-cyclohexyl-1-(3,3-difluoro-1-phenethylcarbamoyl-propylcarbamoyl)-ethylcarbamoyl]-3-methoxycarbonyl-propylcarbamoyl}-2,2-diphenyl-ethylcarbamoyl)-butyric acid | CHEMBL409677
TypeSmall organic molecule
Emp. Form.C52H65F2N7O13
Mol. Mass.1034.1084
SMILESCC(=O)N[C@@H](CC(O)=O)C(=O)N[C@@H](CCC(O)=O)C(=O)N[C@@H](C(c1ccccc1)c1ccccc1)C(=O)N[C@@H](CCC(O)=O)C(=O)N[C@@H](CC1CCCCC1)C(=O)N[C@@H](CC(F)F)C(=O)NCCc1ccccc1