Reaction Details
TargetGenome polyprotein
LigandBDBM50122891
Substrate/Competitorn/a
Meas. Tech.ChEMBL_143627 (CHEMBL751835)
Ki 600±n/a nM
Citation Colarusso, SKoch, UGerlach, BSteinkühler, CDe Francesco, RAltamura, SMatassa, VGNarjes, F Phenethyl amides as novel noncovalent inhibitors of hepatitis C virus NS3/4A protease: discovery, initial SAR, and molecular modeling. J Med Chem46:345-8 (2003) 
 
Genome polyprotein
Name:Genome polyprotein
Type:Protein
Mol. Mass.:67067.41
Organism:Hepatitis C virus
Description:A3EZI9
Residue:631
BDBM50122891
NameBDBM50122891
Synonyms:4-(2-{2-[2-(4-Carboxy-2-isobutoxycarbonylamino-butyrylamino)-4-methyl-pentanoylamino]-4,4-difluoro-butyrylamino}-ethyl)-3-chloro-benzoic acid | CHEMBL326818
TypeSmall organic molecule
Emp. Form.C29H41ClF2N4O9
Mol. Mass.663.107
SMILESCC(C)COC(=O)NC(CCC(O)=O)C(=O)N[C@@H](CC(C)C)C(=O)NC(CC(F)F)C(=O)NCCc1ccc(cc1Cl)C(O)=O