Reaction Details
TargetMitogen-activated protein kinase 11
LigandBDBM50122922
Substrate/Competitorn/a
Meas. Tech.ChEMBL_124648 (CHEMBL731909)
IC50 64±n/a nM
Citation Colletti, SLFrie, JLDixon, ECSingh, SBChoi, BKScapin, GFitzgerald, CEKumar, SNichols, EAO'Keefe, SJO'Neill, EAPorter, GSamuel, KSchmatz, DMSchwartz, CDShoop, WLThompson, CMThompson, JEWang, RWoods, AZaller, DMDoherty, JB Hybrid-designed inhibitors of p38 MAP kinase utilizing N-arylpyridazinones. J Med Chem46:349-52 (2003) 
 
Mitogen-activated protein kinase 11
Name:Mitogen-activated protein kinase 11
Type:Enzyme
Mol. Mass.:41390.66
Organism:Mus musculus (mouse)
Description:Q9WUI1
Residue:364
BDBM50122922
NameBDBM50122922
Synonyms:6-[2-(2-Chloro-4-fluoro-phenyl)-imidazo[1,2-a]pyridin-3-yl]-2-(2,6-dichloro-phenyl)-2H-pyridazin-3-one | CHEMBL118768
TypeSmall organic molecule
Emp. Form.C23H12Cl3FN4O
Mol. Mass.485.725
SMILESFc1ccc(-c2nc3ccccn3c2-c2ccc(=O)n(n2)-c2c(Cl)cccc2Cl)c(Cl)c1