Reaction Details
TargetMitogen-activated protein kinase 11
LigandBDBM50122919
Substrate/Competitorn/a
Meas. Tech.ChEMBL_124648 (CHEMBL731909)
IC50 2600±n/a nM
Citation Colletti, SLFrie, JLDixon, ECSingh, SBChoi, BKScapin, GFitzgerald, CEKumar, SNichols, EAO'Keefe, SJO'Neill, EAPorter, GSamuel, KSchmatz, DMSchwartz, CDShoop, WLThompson, CMThompson, JEWang, RWoods, AZaller, DMDoherty, JB Hybrid-designed inhibitors of p38 MAP kinase utilizing N-arylpyridazinones. J Med Chem46:349-52 (2003) 
 
Mitogen-activated protein kinase 11
Name:Mitogen-activated protein kinase 11
Type:Enzyme
Mol. Mass.:41390.66
Organism:Mus musculus (mouse)
Description:Q9WUI1
Residue:364
BDBM50122919
NameBDBM50122919
Synonyms:6-[2-(2-Chloro-4-fluoro-phenyl)-imidazo[1,2-a]pyridin-3-yl]-2-(2-chloro-phenyl)-4,5-dihydro-2H-pyridazin-3-one | CHEMBL118917
TypeSmall organic molecule
Emp. Form.C23H15Cl2FN4O
Mol. Mass.453.296
SMILESFc1ccc(-c2nc3ccccn3c2C2=NN(C(=O)CC2)c2ccccc2Cl)c(Cl)c1