Reaction Details
TargetMitogen-activated protein kinase 14
LigandBDBM50122915
Substrate/Competitorn/a
Meas. Tech.ChEMBL_124502 (CHEMBL733338)
IC50 8±n/a nM
Citation Colletti, SLFrie, JLDixon, ECSingh, SBChoi, BKScapin, GFitzgerald, CEKumar, SNichols, EAO'Keefe, SJO'Neill, EAPorter, GSamuel, KSchmatz, DMSchwartz, CDShoop, WLThompson, CMThompson, JEWang, RWoods, AZaller, DMDoherty, JB Hybrid-designed inhibitors of p38 MAP kinase utilizing N-arylpyridazinones. J Med Chem46:349-52 (2003) 
 
Mitogen-activated protein kinase 14
Name:Mitogen-activated protein kinase 14
Type:Enzyme
Mol. Mass.:41281.22
Organism:Mus musculus (mouse)
Description:The full-length open reading frame of murine p38 alpha was cloned and expressed in E. coli.. Soluble murine p38R was extracted from cell pellets and purified using ion-exchange chromatography.
Residue:360
BDBM50122915
NameBDBM50122915
Synonyms:2-(2,6-Dichloro-phenyl)-6-[2-(2,4-difluoro-phenyl)-imidazo[1,2-a]pyridin-3-yl]-4,5-dihydro-2H-pyridazin-3-one CHEMBL334215
TypeSmall organic molecule
Emp. Form.C23H14Cl2F2N4O
Mol. Mass.471.286
SMILESFc1ccc(-c2nc3ccccn3c2C2=NN(C(=O)CC2)c2c(Cl)cccc2Cl)c(F)c1