Reaction Details
TargetAdenosine receptor A1
LigandBDBM50122929
Substrate/Competitorn/a
Meas. Tech.ChEMBL_28036 (CHEMBL643032)
Ki 4600±n/a nM
Citation DeNinno, MPMasamune, HChenard, LKDiRico, KJEller, CEtienne, JBTickner, JEKennedy, SPKnight, DRKong, JOleynek, JJTracey, WRHill, RJ 3'-Aminoadenosine-5'-uronamides: discovery of the first highly selective agonist at the human adenosine A3 receptor. J Med Chem46:353-5 (2003) 
 
Adenosine receptor A1
Name:Adenosine receptor A1
Type:G Protein-Coupled Receptor (GPCR)
Mol. Mass.:36520.92
Organism:Homo sapiens (Human)
Description:P30542
Residue:326
BDBM50122929
NameBDBM50122929
Synonyms:3-Amino-4-hydroxy-5-[6-(3-iodo-benzylamino)-purin-9-yl]-tetrahydro-furan-2-carboxylic acid methylamide | CHEMBL334221
TypeSmall organic molecule
Emp. Form.C18H20IN7O3
Mol. Mass.509.301
SMILESCNC(=O)[C@H]1O[C@H]([C@H](O)[C@@H]1N)n1cnc2c(NCc3cccc(I)c3)ncnc12