Reaction Details
TargetAdenosine receptor A3
LigandBDBM50122930
Substrate/Competitorn/a
Meas. Tech.ChEMBL_29902 (CHEMBL641973)
Ki 120±n/a nM
Citation DeNinno, MPMasamune, HChenard, LKDiRico, KJEller, CEtienne, JBTickner, JEKennedy, SPKnight, DRKong, JOleynek, JJTracey, WRHill, RJ 3'-Aminoadenosine-5'-uronamides: discovery of the first highly selective agonist at the human adenosine A3 receptor. J Med Chem46:353-5 (2003) 
 
Adenosine receptor A3
Name:Adenosine receptor A3
Type:G Protein-Coupled Receptor (GPCR)
Mol. Mass.:36197.32
Organism:Homo sapiens (Human)
Description:P0DMS8
Residue:318
BDBM50122930
NameBDBM50122930
Synonyms:(2S,3S,4R,5R)-3-amino-4-hydroxy-N-methyl-5-(6-(methylamino)-9H-purin-9-yl)-tetrahydrofuran-2-carboxamide CHEMBL118507
TypeSmall organic molecule
Emp. Form.C12H17N7O3
Mol. Mass.307.3085
SMILESCNC(=O)[C@H]1O[C@H]([C@H](O)[C@@H]1N)n1cnc2c(NC)ncnc12