Reaction Details
TargetProtein kinase C alpha type
LigandBDBM50122945
Substrate/Competitorn/a
Meas. Tech.ChEMBL_160297 (CHEMBL769625)
Ki 11±n/a nM
Citation Kozikowski, APNowak, IPetukhov, PAEtcheberrigaray, RMohamed, ATan, MLewin, NHennings, HPearce, LLBlumberg, PM New amide-bearing benzolactam-based protein kinase C modulators induce enhanced secretion of the amyloid precursor protein metabolite sAPPalpha. J Med Chem46:364-73 (2003) 
 
Protein kinase C alpha type
Name:Protein kinase C alpha type
Type:Enzyme
Mol. Mass.:76755.65
Organism:Homo sapiens (Human)
Description:The recombinant human PKC enzymes were produced using a baculovirus expression system in SF9 cells
Residue:672
BDBM50122945
NameBDBM50122945
Synonyms:5-[4-(3,3,4,4,5,5,6,6,7,7,8,8,8-Tridecafluoro-oct-1-enyl)-phenyl]-penta-2,4-dienoic acid (5-hydroxymethyl-2-isopropyl-1-methyl-3-oxo-1,2,3,4,5,6-hexahydro-benzo[e][1,4]diazocin-8-yl)-amide | CHEMBL123355
TypeSmall organic molecule
Emp. Form.C34H32F13N3O3
Mol. Mass.777.6154
SMILESCC(C)[C@@H]1N(C)c2ccc(NC(=O)\C=C\C=C\c3ccc(\C=C\C(F)(F)C(F)(F)C(F)(F)C(F)(F)C(F)(F)C(F)(F)F)cc3)cc2C[C@@H](CO)NC1=O