Reaction Details
TargetcGMP-specific 3',5'-cyclic phosphodiesterase
LigandBDBM50122976
Substrate/Competitorn/a
Meas. Tech.ChEMBL_155375 (CHEMBL760828)
Ki 1±n/a nM
Citation Jiang, WSui, ZMacielag, MJWalsh, SPFiordeliso, JJLanter, JCGuan, JQiu, YKraft, PBhattacharjee, SCraig, EHaynes-Johnson, DJohn, TMClancy, J Furoyl and benzofuroyl pyrroloquinolones as potent and selective PDE5 inhibitors for treatment of erectile dysfunction. J Med Chem46:441-4 (2003) 
 
cGMP-specific 3',5'-cyclic phosphodiesterase
Name:cGMP-specific 3',5'-cyclic phosphodiesterase
Type:Protein
Mol. Mass.:99975.83
Organism:Homo sapiens (Human)
Description:O76074
Residue:875
BDBM50122976
NameBDBM50122976
Synonyms:4-[5-(3-Benzo[1,3]dioxol-5-yl-9-oxo-1,3,4,9-tetrahydro-pyrrolo[3,4-b]quinoline-2-carbonyl)-furan-2-yl]-benzoic acid | CHEMBL136521
TypeSmall organic molecule
Emp. Form.C30H20N2O7
Mol. Mass.520.489
SMILESOC(=O)c1ccc(cc1)-c1ccc(o1)C(=O)N1Cc2c(nc3ccccc3c2O)C1c1ccc2OCOc2c1