Reaction Details
TargetcGMP-specific 3',5'-cyclic phosphodiesterase
LigandBDBM50122987
Substrate/Competitorn/a
Meas. Tech.ChEMBL_155375 (CHEMBL760828)
Ki 0.760000±n/a nM
Citation Jiang, WSui, ZMacielag, MJWalsh, SPFiordeliso, JJLanter, JCGuan, JQiu, YKraft, PBhattacharjee, SCraig, EHaynes-Johnson, DJohn, TMClancy, J Furoyl and benzofuroyl pyrroloquinolones as potent and selective PDE5 inhibitors for treatment of erectile dysfunction. J Med Chem46:441-4 (2003) 
 
cGMP-specific 3',5'-cyclic phosphodiesterase
Name:cGMP-specific 3',5'-cyclic phosphodiesterase
Type:Protein
Mol. Mass.:99975.83
Organism:Homo sapiens (Human)
Description:O76074
Residue:875
BDBM50122987
NameBDBM50122987
Synonyms:3-Benzo[1,3]dioxol-5-yl-2-{5-[4-(2-pyrrolidin-1-yl-ethoxy)-phenyl]-furan-2-carbonyl}-1,2,3,4-tetrahydro-pyrrolo[3,4-b]quinolin-9-one | CHEMBL342404
TypeSmall organic molecule
Emp. Form.C35H31N3O6
Mol. Mass.589.6371
SMILESOc1c2CN(C(c2nc2ccccc12)c1ccc2OCOc2c1)C(=O)c1ccc(o1)-c1ccc(OCCN2CCCC2)cc1