Reaction Details
TargetCoagulation factor X
LigandBDBM50123033
Substrate/Competitorn/a
Meas. Tech.ChEBML_69668
Ki 0.350000±n/a nM
Citation Quan, MLEllis, CDHe, MYLiauw, AYWoerner, FJAlexander, RSKnabb, RMLam, PYLuettgen, JMWong, PCWright, MRWexler, RR Nonbenzamidine tetrazole derivatives as factor Xa inhibitors. Bioorg Med Chem Lett13:369-73 (2003) Coagulation factor X
Name:Coagulation factor X
Type:Enzyme
Mol. Mass.:54726.60
Organism:Homo sapiens (Human)
Description:n/a
Residue:488
BDBM50123033
NameBDBM50123033
Synonyms:1-(3-Amino-benzo[d]isoxazol-5-yl)-1H-tetrazole-5-carboxylic acid (3-fluoro-2'-sulfamoyl-biphenyl-4-yl)-amide | CHEMBL333270
TypeSmall organic molecule
Emp. Form.C21H15FN8O4S
Mol. Mass.494.458
SMILESNc1noc2ccc(cc12)-n1nnnc1C(=O)Nc1ccc(cc1F)-c1ccccc1S(N)(=O)=O