Reaction Details
TargetThyroid hormone receptor beta
LigandBDBM50123047
Substrate/Competitorn/a
Meas. Tech.ChEBML_210497
Ki 13±n/a nM
Citation Dow, RLSchneider, SRPaight, ESHank, RFChiang, PCornelius, PLee, ENewsome, WPSwick, AGSpitzer, JHargrove, DMPatterson, TAPandit, JChrunyk, BALeMotte, PKDanley, DERosner, MHAmmirati, MJSimons, SPSchulte, GKTate, BFDaSilva-Jardine, P Discovery of a novel series of 6-azauracil-based thyroid hormone receptor ligands: potent, TR beta subtype-selective thyromimetics. Bioorg Med Chem Lett13:379-82 (2003) Thyroid hormone receptor beta
Name:Thyroid hormone receptor beta
Type:Receptor
Mol. Mass.:52793.62
Organism:Homo sapiens (Human)
Description:Recombinant hThR was obtained from nuclear extracts from SF9 cells infected with baculovirus vectors encoding for ThRbeta 1.
Residue:461
BDBM50123047
NameBDBM50123047
Synonyms:2-{3-Chloro-4-[4-hydroxy-3-(4-methyl-piperazine-1-sulfonyl)-phenoxy]-5-methyl-phenyl}-2H-[1,2,4]triazine-3,5-dione | CHEMBL127338
TypeSmall organic molecule
Emp. Form.C21H22ClN5O6S
Mol. Mass.507.947
SMILESCN1CCN(CC1)S(=O)(=O)c1cc(Oc2c(C)cc(cc2Cl)-n2ncc(=O)[nH]c2=O)ccc1O