Reaction Details
TargetThyroid hormone receptor beta
LigandBDBM50123053
Substrate/Competitorn/a
Meas. Tech.ChEBML_210497
Ki 2±n/a nM
Citation Dow, RLSchneider, SRPaight, ESHank, RFChiang, PCornelius, PLee, ENewsome, WPSwick, AGSpitzer, JHargrove, DMPatterson, TAPandit, JChrunyk, BALeMotte, PKDanley, DERosner, MHAmmirati, MJSimons, SPSchulte, GKTate, BFDaSilva-Jardine, P Discovery of a novel series of 6-azauracil-based thyroid hormone receptor ligands: potent, TR beta subtype-selective thyromimetics. Bioorg Med Chem Lett13:379-82 (2003) Thyroid hormone receptor beta
Name:Thyroid hormone receptor beta
Type:Receptor
Mol. Mass.:52793.62
Organism:Homo sapiens (Human)
Description:Recombinant hThR was obtained from nuclear extracts from SF9 cells infected with baculovirus vectors encoding for ThRbeta 1.
Residue:461
BDBM50123053
NameBDBM50123053
Synonyms:2-[3,5-Dimethyl-4-(3-methyl-4-methylsulfanyl-phenoxy)-phenyl]-2H-[1,2,4]triazine-3,5-dione | CHEMBL56801
TypeSmall organic molecule
Emp. Form.C19H19N3O3S
Mol. Mass.369.437
SMILESCSc1ccc(Oc2c(C)cc(cc2C)-n2ncc(=O)[nH]c2=O)cc1C