Reaction Details
TargetSodium-dependent serotonin transporter
LigandBDBM50123070
Substrate/Competitorn/a
Meas. Tech.ChEBML_201994
Ki 1±n/a nM
Citation van Hes, RSmid, PStroomer, CNTipker, KTulp, MTvan der Heyden, JAMcCreary, ACHesselink, MBKruse, CG SLV310, a novel, potential antipsychotic, combining potent dopamine D2 receptor antagonism with serotonin reuptake inhibition. Bioorg Med Chem Lett13:405-8 (2003) Sodium-dependent serotonin transporter
Name:Sodium-dependent serotonin transporter
Type:Multi-pass membrane protein
Mol. Mass.:70168.43
Organism:Rattus norvegicus (rat)
Description:P31652
Residue:630
BDBM50123070
NameBDBM50123070
Synonyms:2-{5-[4-(5-Fluoro-1H-indol-3-yl)-3,6-dihydro-2H-pyridin-1-yl]-pentyl}-4-methyl-isoindole-1,3-dione | CHEMBL335259
TypeSmall organic molecule
Emp. Form.C27H28FN3O2
Mol. Mass.445.5285
SMILESCc1cccc2C(=O)N(CCCCCN3CCC(=CC3)c3c[nH]c4ccc(F)cc34)C(=O)c12