Reaction Details
TargetChorismate synthase
LigandBDBM50123115
Substrate/Competitorn/a
Meas. Tech.ChEBML_49434
IC50 5500±n/a nM
Citation Thomas, MGLawson, CAllanson, NMLeslie, BWBottomley, JRMcBride, AOlusanya, OA A series of 2(Z)-2-benzylidene-6,7-dihydroxybenzofuran-3[2H]-ones as inhibitors of chorismate synthase. Bioorg Med Chem Lett13:423-6 (2003) Chorismate synthase
Name:Chorismate synthase
Type:PROTEIN
Mol. Mass.:42869.22
Organism:Streptococcus pneumoniae
Description:ChEMBL_49433
Residue:388
BDBM50123115
NameBDBM50123115
Synonyms:6,7-Dihydroxy-2-[1-(4-pyrrolidin-1-yl-phenyl)-meth-(E)-ylidene]-benzofuran-3-one | CHEMBL335859
TypeSmall organic molecule
Emp. Form.C19H17NO4
Mol. Mass.323.3426
SMILESOc1ccc2C(=O)\C(Oc2c1O)=C/c1ccc(cc1)N1CCCC1