Reaction Details
TargetTumor necrosis factor receptor superfamily member 1A
LigandBDBM50123291
Substrate/Competitorn/a
Meas. Tech.ChEBML_212214
IC50 140±n/a nM
Citation Voss, MECarter, PHTebben, AJScherle, PABrown, GDThompson, LAXu, MLo, YCYang, GLiu, RQStrzemienski, PEverlof, JGTrzaskos, JMDecicco, CP Both 5-arylidene-2-thioxodihydropyrimidine-4,6(1H,5H)-diones and 3-thioxo-2,3-dihydro-1H-imidazo[1,5-a]indol-1-ones are light-dependent tumor necrosis factor-alpha antagonists. Bioorg Med Chem Lett13:533-8 (2003) Tumor necrosis factor receptor superfamily member 1A
Name:Tumor necrosis factor receptor superfamily member 1A
Type:PROTEIN
Mol. Mass.:50495.39
Organism:Homo sapiens (Human)
Description:ChEMBL_1509419
Residue:455
BDBM50123291
NameBDBM50123291
Synonyms:3-Ethyl-5-[1-[5-(2-methyl-5-trifluoromethyl-2H-pyrazol-3-yl)-thiophen-2-yl]-meth-(Z)-ylidene]-2-thioxo-thiazolidin-4-one | CHEMBL357092
TypeSmall organic molecule
Emp. Form.C15H12F3N3OS3
Mol. Mass.403.465
SMILESCCN1C(=S)S\C(=C/c2ccc(s2)-c2cc(nn2C)C(F)(F)F)C1=O