Reaction Details
TargetTumor necrosis factor receptor superfamily member 1A
LigandBDBM50123293
Substrate/Competitorn/a
Meas. Tech.ChEBML_212214
IC50 210±n/a nM
Citation Voss, MECarter, PHTebben, AJScherle, PABrown, GDThompson, LAXu, MLo, YCYang, GLiu, RQStrzemienski, PEverlof, JGTrzaskos, JMDecicco, CP Both 5-arylidene-2-thioxodihydropyrimidine-4,6(1H,5H)-diones and 3-thioxo-2,3-dihydro-1H-imidazo[1,5-a]indol-1-ones are light-dependent tumor necrosis factor-alpha antagonists. Bioorg Med Chem Lett13:533-8 (2003) Tumor necrosis factor receptor superfamily member 1A
Name:Tumor necrosis factor receptor superfamily member 1A
Type:PROTEIN
Mol. Mass.:50495.39
Organism:Homo sapiens (Human)
Description:ChEMBL_1509419
Residue:455
BDBM50123293
NameBDBM50123293
Synonyms:2-Allyl-6,8-dimethoxy-9-methyl-1-thioxo-1,2-dihydro-imidazo[1,5-a]indol-3-one | CHEMBL150292
TypeSmall organic molecule
Emp. Form.C16H16N2O3S
Mol. Mass.316.375
SMILESCOc1cc(OC)c2c(c1)n1c(c(S)n(CC=C)c1=O)c2=C