Reaction Details
TargetTumor necrosis factor receptor superfamily member 1A
LigandBDBM50123297
Substrate/Competitorn/a
Meas. Tech.ChEBML_212214
IC50 610±n/a nM
Citation Voss, MECarter, PHTebben, AJScherle, PABrown, GDThompson, LAXu, MLo, YCYang, GLiu, RQStrzemienski, PEverlof, JGTrzaskos, JMDecicco, CP Both 5-arylidene-2-thioxodihydropyrimidine-4,6(1H,5H)-diones and 3-thioxo-2,3-dihydro-1H-imidazo[1,5-a]indol-1-ones are light-dependent tumor necrosis factor-alpha antagonists. Bioorg Med Chem Lett13:533-8 (2003) Tumor necrosis factor receptor superfamily member 1A
Name:Tumor necrosis factor receptor superfamily member 1A
Type:PROTEIN
Mol. Mass.:50495.39
Organism:Homo sapiens (Human)
Description:ChEMBL_1509419
Residue:455
BDBM50123297
NameBDBM50123297
Synonyms:2-Allyl-6,8-dimethoxy-1-thioxo-1,2-dihydro-imidazo[1,5-a]indol-3-one | CHEMBL345772
TypeSmall organic molecule
Emp. Form.C15H14N2O3S
Mol. Mass.302.348
SMILESCOc1cc(OC)c2cc3C(=S)N(CC=C)C(=O)n3c2c1