Reaction Details
TargetTumor necrosis factor receptor superfamily member 1A
LigandBDBM50123304
Substrate/Competitorn/a
Meas. Tech.ChEBML_212214
IC50 2800±n/a nM
Citation Voss, MECarter, PHTebben, AJScherle, PABrown, GDThompson, LAXu, MLo, YCYang, GLiu, RQStrzemienski, PEverlof, JGTrzaskos, JMDecicco, CP Both 5-arylidene-2-thioxodihydropyrimidine-4,6(1H,5H)-diones and 3-thioxo-2,3-dihydro-1H-imidazo[1,5-a]indol-1-ones are light-dependent tumor necrosis factor-alpha antagonists. Bioorg Med Chem Lett13:533-8 (2003) Tumor necrosis factor receptor superfamily member 1A
Name:Tumor necrosis factor receptor superfamily member 1A
Type:PROTEIN
Mol. Mass.:50495.39
Organism:Homo sapiens (Human)
Description:ChEMBL_1509419
Residue:455
BDBM50123304
NameBDBM50123304
Synonyms:3-[5-(1,3-Diethyl-4,6-dioxo-2-thioxo-tetrahydro-pyrimidin-5-ylidenemethyl)-furan-2-yl]-thiophene-2-carboxylic acid methyl ester | CHEMBL149465
TypeSmall organic molecule
Emp. Form.C19H18N2O5S2
Mol. Mass.418.487
SMILES[#6]-[#6]-[#7]-1-[#6](=S)-[#7](-[#6]-[#6])-[#6](=O)\[#6](=[#6]/c2ccc(o2)-c2ccsc2-[#6](=O)-[#8]-[#6])-[#6]-1=O