Reaction Details
TargetTumor necrosis factor receptor superfamily member 1A
LigandBDBM50123305
Substrate/Competitorn/a
Meas. Tech.ChEBML_212214
IC50 1000±n/a nM
Citation Voss, MECarter, PHTebben, AJScherle, PABrown, GDThompson, LAXu, MLo, YCYang, GLiu, RQStrzemienski, PEverlof, JGTrzaskos, JMDecicco, CP Both 5-arylidene-2-thioxodihydropyrimidine-4,6(1H,5H)-diones and 3-thioxo-2,3-dihydro-1H-imidazo[1,5-a]indol-1-ones are light-dependent tumor necrosis factor-alpha antagonists. Bioorg Med Chem Lett13:533-8 (2003) Tumor necrosis factor receptor superfamily member 1A
Name:Tumor necrosis factor receptor superfamily member 1A
Type:PROTEIN
Mol. Mass.:50495.39
Organism:Homo sapiens (Human)
Description:ChEMBL_1509419
Residue:455
BDBM50123305
NameBDBM50123305
Synonyms:1,3-Diethyl-5-(1H-indol-3-ylmethylene)-2-thioxo-dihydro-pyrimidine-4,6-dione | CHEMBL345500
TypeSmall organic molecule
Emp. Form.C17H17N3O2S
Mol. Mass.327.401
SMILESCCN1C(=S)N(CC)C(=O)C(=Cc2c[nH]c3ccccc23)C1=O