Reaction Details
TargetAnionic trypsin-2
LigandBDBM50123417
Substrate/Competitorn/a
Meas. Tech.ChEBML_213052
IC50 25±n/a nM
Citation Huang, WZhang, PZuckett, JFWang, LWoolfrey, JSong, YJia, ZJClizbe, LASu, TTran, KHuang, BWong, PSinha, UPark, GReed, AMalinowski, JHollenbach, SJScarborough, RMZhu, BY Design, synthesis and structure-activity relationships of benzoxazinone-based factor Xa inhibitors. Bioorg Med Chem Lett13:561-6 (2003) Anionic trypsin-2
Name:Anionic trypsin-2
Type:PROTEIN
Mol. Mass.:26220.44
Organism:Rattus norvegicus
Description:ChEMBL_213052
Residue:246
BDBM50123417
NameBDBM50123417
Synonyms:2-[({4-[1-(1-Imino-ethyl)-piperidin-4-yloxy]-phenyl}-methanesulfonyl-amino)-methyl]-1-methyl-1H-indole-6-carboxamidine | CHEMBL153134
TypeSmall organic molecule
Emp. Form.C25H32N6O3S
Mol. Mass.496.625
SMILESCC(=N)N1CCC(CC1)Oc1ccc(cc1)N(Cc1cc2ccc(cc2n1C)C(N)=N)S(C)(=O)=O