Reaction Details
TargetAnionic trypsin-2
LigandBDBM50123421
Substrate/Competitorn/a
Meas. Tech.ChEBML_213052
IC50>10000±n/a nM
Citation Huang, WZhang, PZuckett, JFWang, LWoolfrey, JSong, YJia, ZJClizbe, LASu, TTran, KHuang, BWong, PSinha, UPark, GReed, AMalinowski, JHollenbach, SJScarborough, RMZhu, BY Design, synthesis and structure-activity relationships of benzoxazinone-based factor Xa inhibitors. Bioorg Med Chem Lett13:561-6 (2003) Anionic trypsin-2
Name:Anionic trypsin-2
Type:PROTEIN
Mol. Mass.:26220.44
Organism:Rattus norvegicus
Description:ChEMBL_213052
Residue:246
BDBM50123421
NameBDBM50123421
Synonyms:3-{5-[({4-[1-(1-Imino-ethyl)-piperidin-4-yloxy]-phenyl}-methanesulfonyl-amino)-methyl]-isoxazol-3-yl}-benzamidine | CHEMBL345763
TypeSmall organic molecule
Emp. Form.C25H30N6O4S
Mol. Mass.510.608
SMILESCC(=N)N1CCC(CC1)Oc1ccc(cc1)N(Cc1cc(no1)-c1cccc(c1)C(N)=N)S(C)(=O)=O