Reaction Details
TargetAnionic trypsin-2
LigandBDBM50123423
Substrate/Competitorn/a
Meas. Tech.ChEBML_213052
IC50 2110±n/a nM
Citation Huang, WZhang, PZuckett, JFWang, LWoolfrey, JSong, YJia, ZJClizbe, LASu, TTran, KHuang, BWong, PSinha, UPark, GReed, AMalinowski, JHollenbach, SJScarborough, RMZhu, BY Design, synthesis and structure-activity relationships of benzoxazinone-based factor Xa inhibitors. Bioorg Med Chem Lett13:561-6 (2003) Anionic trypsin-2
Name:Anionic trypsin-2
Type:PROTEIN
Mol. Mass.:26220.44
Organism:Rattus norvegicus
Description:ChEMBL_213052
Residue:246
BDBM50123423
NameBDBM50123423
Synonyms:3-{3-[({4-[1-(1-Imino-ethyl)-piperidin-4-yloxy]-phenyl}-methanesulfonyl-amino)-methyl]-5-methyl-pyrazol-1-yl}-benzamidine | CHEMBL152490
TypeSmall organic molecule
Emp. Form.C26H33N7O3S
Mol. Mass.523.65
SMILESCC(=N)N1CCC(CC1)Oc1ccc(cc1)N(Cc1cc(C)n(n1)-c1cccc(c1)C(N)=N)S(C)(=O)=O