Reaction Details
TargetC-C chemokine receptor type 5
LigandBDBM50123446
Substrate/Competitorn/a
Meas. Tech.ChEMBL_39648 (CHEMBL649953)
Ki 11±n/a nM
Citation McCombie, SWTagat, JRVice, SFLin, SISteensma, RPalani, ANeustadt, BRBaroudy, BMStrizki, JMEndres, MCox, KDan, NChou, CC Piperazine-based CCR5 antagonists as HIV-1 inhibitors. III: synthesis, antiviral and pharmacokinetic profiles of symmetrical heteroaryl carboxamides. Bioorg Med Chem Lett13:567-71 (2003) C-C chemokine receptor type 5
Name:C-C chemokine receptor type 5
Type:Enzyme
Mol. Mass.:40540.21
Organism:Homo sapiens (Human)
Description:P51681
Residue:352
BDBM50123446
NameBDBM50123446
Synonyms:(4,6-Dimethyl-pyrimidin-5-yl)-(4-methyl-4-{(S)-3-methyl-4-[(S)-1-(4-trifluoromethoxy-phenyl)-ethyl]-piperazin-1-yl}-piperidin-1-yl)-methanone | CHEMBL357557
TypeSmall organic molecule
Emp. Form.C27H36F3N5O2
Mol. Mass.519.6022
SMILESC[C@H](N1CCN(C[C@@H]1C)C1(C)CCN(CC1)C(=O)c1c(C)ncnc1C)c1ccc(OC(F)(F)F)cc1