Reaction Details
TargetMuscarinic acetylcholine receptor M1
LigandBDBM50104956
Substrate/Competitorn/a
Meas. Tech.ChEBML_139207
Ki 350±n/a nM
Citation McCombie, SWTagat, JRVice, SFLin, SISteensma, RPalani, ANeustadt, BRBaroudy, BMStrizki, JMEndres, MCox, KDan, NChou, CC Piperazine-based CCR5 antagonists as HIV-1 inhibitors. III: synthesis, antiviral and pharmacokinetic profiles of symmetrical heteroaryl carboxamides. Bioorg Med Chem Lett13:567-71 (2003) Muscarinic acetylcholine receptor M1
Name:Muscarinic acetylcholine receptor M1
Type:Protein
Mol. Mass.:51442.54
Organism:Homo sapiens (Human)
Description:P11229
Residue:460
BDBM50104956
NameBDBM50104956
Synonyms:(2,4-Dimethyl-1-oxy-pyridin-3-yl)-(4-methyl-4-{(S)-3-methyl-4-[(S)-1-(4-trifluoromethyl-phenyl)-ethyl]-piperazin-1-yl}-piperidin-1-yl)-methanone CHEMBL322251
TypeSmall organic molecule
Emp. Form.C28H37F3N4O2
Mol. Mass.518.6142
SMILESC[C@H](N1CCN(C[C@@H]1C)C1(C)CCN(CC1)C(=O)c1c(C)cc[n+]([O-])c1C)c1ccc(cc1)C(F)(F)F