Reaction Details
TargetcGMP-specific 3',5'-cyclic phosphodiesterase
LigandBDBM14776
Substrate/Competitorn/a
Meas. Tech.ChEMBL_155209 (CHEMBL762826)
IC50 0.700000±n/a nM
Citation Yu, GMason, HWu, XWang, JChong, SBeyer, BHenwood, APongrac, RSeliger, LHe, BNormandin, DFerrer, PZhang, RAdam, LHumphrey, WGKrupinski, JMacor, JE Substituted pyrazolopyridopyridazines as orally bioavailable potent and selective PDE5 inhibitors: potential agents for treatment of erectile dysfunction. J Med Chem46:457-60 (2003) 
 
cGMP-specific 3',5'-cyclic phosphodiesterase
Name:cGMP-specific 3',5'-cyclic phosphodiesterase
Type:Protein
Mol. Mass.:99975.83
Organism:Homo sapiens (Human)
Description:O76074
Residue:875
BDBM14776
NameBDBM14776
Synonyms:2-{2-ethoxy-5-[(4-ethylpiperazine-1-)sulfonyl]phenyl}-5-methyl-7-propyl-3H,4H-imidazo[1,5-a][1,2,4]triazin-4-one Vardenafil | citric acid;2-[2-ethoxy-5-(4-ethylpiperazino)sulfonyl-phenyl]-5-methyl-7-propyl-1H-imidazo[5,1-f][1,2,4]triazin-4-one
TypeSmall organic molecule
Emp. Form.C23H32N6O4S
Mol. Mass.488.603
SMILESCCCc1nc(C)c2n1nc([nH]c2=O)-c1cc(ccc1OCC)S(=O)(=O)N1CCN(CC)CC1