Reaction Details
TargetSerine protease 1
LigandBDBM50123496
Substrate/Competitorn/a
Meas. Tech.ChEMBL_212685 (CHEMBL815470)
Ki 3600±n/a nM
Citation Burgey, CSRobinson, KALyle, TASanderson, PELewis, SDLucas, BJKrueger, JASingh, RMiller-Stein, CWhite, RBWong, BLyle, EAWilliams, PDCoburn, CADorsey, BDBarrow, JCStranieri, MTHolahan, MASitko, GRCook, JJMcMasters, DRMcDonough, CMSanders, WMWallace, AAClayton, FCBohn, DLeonard, YMDetwiler, TJLynch, JJYan, YChen, ZKuo, LGardell, SJShafer, JAVacca, JP Metabolism-directed optimization of 3-aminopyrazinone acetamide thrombin inhibitors. Development of an orally bioavailable series containing P1 and P3 pyridines. J Med Chem46:461-73 (2003) 
 
Serine protease 1
Name:Serine protease 1
Type:Enzyme
Mol. Mass.:26557.80
Organism:Homo sapiens (Human)
Description:P07477
Residue:247
BDBM50123496
NameBDBM50123496
Synonyms:CHEMBL143138 | N-(6-Amino-2-methyl-pyridin-3-ylmethyl)-2-[6-methyl-2-oxo-3-(2-pyridin-2-yl-ethylamino)-2H-pyrazin-1-yl]-acetamide
TypeSmall organic molecule
Emp. Form.C21H25N7O2
Mol. Mass.407.4689
SMILESCc1nc(N)ccc1CNC(=O)Cn1c(C)cnc(NCCc2ccccn2)c1=O