Reaction Details
TargetProthrombin
LigandBDBM50123490
Substrate/Competitorn/a
Meas. Tech.ChEMBL_210607 (CHEMBL816574)
Ki 0.042±n/a nM
Citation Burgey, CSRobinson, KALyle, TASanderson, PELewis, SDLucas, BJKrueger, JASingh, RMiller-Stein, CWhite, RBWong, BLyle, EAWilliams, PDCoburn, CADorsey, BDBarrow, JCStranieri, MTHolahan, MASitko, GRCook, JJMcMasters, DRMcDonough, CMSanders, WMWallace, AAClayton, FCBohn, DLeonard, YMDetwiler, TJLynch, JJYan, YChen, ZKuo, LGardell, SJShafer, JAVacca, JP Metabolism-directed optimization of 3-aminopyrazinone acetamide thrombin inhibitors. Development of an orally bioavailable series containing P1 and P3 pyridines. J Med Chem46:461-73 (2003) 
 
Prothrombin
Name:Prothrombin
Type:Protein
Mol. Mass.:70029.57
Organism:Homo sapiens (Human)
Description:P00734
Residue:622
BDBM50123490
NameBDBM50123490
Synonyms:CHEMBL143418 | N-(6-Amino-2-methyl-pyridin-3-ylmethyl)-2-[3-(2,2-difluoro-2-pyridin-2-yl-ethylamino)-6-methyl-2-oxo-2H-pyrazin-1-yl]-acetamide
TypeSmall organic molecule
Emp. Form.C21H23F2N7O2
Mol. Mass.443.4498
SMILESCc1cnc(NCC(F)(F)c2ccccn2)c(=O)n1CC(=O)NCc1ccc(N)nc1C