Reaction Details
TargetProthrombin
LigandBDBM50123481
Substrate/Competitorn/a
Meas. Tech.ChEMBL_210607 (CHEMBL816574)
Ki 2.3±n/a nM
Citation Burgey, CSRobinson, KALyle, TASanderson, PELewis, SDLucas, BJKrueger, JASingh, RMiller-Stein, CWhite, RBWong, BLyle, EAWilliams, PDCoburn, CADorsey, BDBarrow, JCStranieri, MTHolahan, MASitko, GRCook, JJMcMasters, DRMcDonough, CMSanders, WMWallace, AAClayton, FCBohn, DLeonard, YMDetwiler, TJLynch, JJYan, YChen, ZKuo, LGardell, SJShafer, JAVacca, JP Metabolism-directed optimization of 3-aminopyrazinone acetamide thrombin inhibitors. Development of an orally bioavailable series containing P1 and P3 pyridines. J Med Chem46:461-73 (2003) 
 
Prothrombin
Name:Prothrombin
Type:Protein
Mol. Mass.:70029.57
Organism:Homo sapiens (Human)
Description:P00734
Residue:622
BDBM50123481
NameBDBM50123481
Synonyms:2-(6-cyano-3-(2,2-difluoro-2-(pyridin-2-yl)ethylamino)-2-oxopyrazin-1(2H)-yl)-N-((3-fluoropyridin-2-yl)methyl)acetamide CHEMBL143024
TypeSmall organic molecule
Emp. Form.C20H16F3N7O2
Mol. Mass.443.3819
SMILESFc1cccnc1CNC(=O)Cn1c(cnc(NCC(F)(F)c2ccccn2)c1=O)C#N