Reaction Details
TargetPotassium voltage-gated channel subfamily A member 5
LigandBDBM50123519
Substrate/Competitorn/a
Meas. Tech.ChEMBL_214964 (CHEMBL821193)
IC50 1200±n/a nM
Citation Peukert, SBrendel, JPirard, BBrüggemann, ABelow, PKleemann, HWHemmerle, HSchmidt, W Identification, synthesis, and activity of novel blockers of the voltage-gated potassium channel Kv1.5. J Med Chem46:486-98 (2003) 
 
Potassium voltage-gated channel subfamily A member 5
Name:Potassium voltage-gated channel subfamily A member 5
Type:Enzyme
Mol. Mass.:67222.47
Organism:Homo sapiens (Human)
Description:P22460
Residue:613
BDBM50123519
NameBDBM50123519
Synonyms:2'-{[2-(4-Methoxy-phenyl)-acetylamino]-methyl}-biphenyl-2-carboxylic acid 2,4-difluoro-benzylamide | CHEMBL148342
TypeSmall organic molecule
Emp. Form.C30H26F2N2O3
Mol. Mass.500.5358
SMILESCOc1ccc(CC(=O)NCc2ccccc2-c2ccccc2C(=O)NCc2ccc(F)cc2F)cc1