Reaction Details
TargetD(1A) dopamine receptor
LigandBDBM50123626
Substrate/Competitorn/a
Meas. Tech.ChEMBL_60330 (CHEMBL672802)
Ki 500±n/a nM
Citation Venhuis, BJDijkstra, DWustrow, DJMeltzer, LTWise, LDJohnson, SJHeffner, TGWikström, HV Orally active analogues of the dopaminergic prodrug 6-(N,N-di-n-propylamino)-3,4,5,6,7,8-hexahydro-2H-naphthalen-1-one: synthesis and pharmacological activity. J Med Chem46:584-90 (2003) 
 
D(1A) dopamine receptor
Name:D(1A) dopamine receptor
Type:Enzyme Catalytic Domain
Mol. Mass.:49330.65
Organism:BOVINE
Description:DOPAMINE D1 DRD1 BOVINE::Q95136
Residue:446
BDBM50123626
NameBDBM50123626
Synonyms:(S)-6-[Propyl-(2-thiophen-2-yl-ethyl)-amino]-5,6,7,8-tetrahydro-naphthalen-1-ol Neupro | ROTIGOTINE
TypeSmall organic molecule
Emp. Form.C19H25NOS
Mol. Mass.315.473
SMILESCCCN(CCc1cccs1)[C@H]1CCc2c(O)cccc2C1