Reaction Details
TargetCannabinoid receptor 1
LigandBDBM50123684
Substrate/Competitorn/a
Meas. Tech.ChEMBL_46640 (CHEMBL658896)
Ki 8±n/a nM
Citation Katoch-Rouse, RPavlova, OACaulder, THoffman, AFMukhin, AGHorti, AG Synthesis, structure-activity relationship, and evaluation of SR141716 analogues: development of central cannabinoid receptor ligands with lower lipophilicity. J Med Chem46:642-5 (2003) 
 
Cannabinoid receptor 1
Name:Cannabinoid receptor 1
Type:G Protein-Coupled Receptor (GPCR)
Mol. Mass.:52856.55
Organism:Rattus norvegicus (rat)
Description:P20272
Residue:473
BDBM50123684
NameBDBM50123684
Synonyms:1-(2-Chloro-phenyl)-5-(4-methoxy-phenyl)-4-methyl-1H-pyrazole-3-carboxylic acid piperidin-1-ylamide | CHEMBL351146
TypeSmall organic molecule
Emp. Form.C23H25ClN4O2
Mol. Mass.424.923
SMILESCOc1ccc(cc1)-c1c(C)c(nn1-c1ccccc1Cl)C(=O)NN1CCCCC1