Reaction Details
TargetCannabinoid receptor 1
LigandBDBM50123685
Substrate/Competitorn/a
Meas. Tech.ChEMBL_46640 (CHEMBL658896)
Ki 1.4±n/a nM
Citation Katoch-Rouse, RPavlova, OACaulder, THoffman, AFMukhin, AGHorti, AG Synthesis, structure-activity relationship, and evaluation of SR141716 analogues: development of central cannabinoid receptor ligands with lower lipophilicity. J Med Chem46:642-5 (2003) 
 
Cannabinoid receptor 1
Name:Cannabinoid receptor 1
Type:G Protein-Coupled Receptor (GPCR)
Mol. Mass.:52856.55
Organism:Rattus norvegicus (rat)
Description:P20272
Residue:473
BDBM50123685
NameBDBM50123685
Synonyms:4-Bromo-5-(4-chloro-phenyl)-1-(2,4-dichloro-phenyl)-1H-pyrazole-3-carboxylic acid piperidin-1-ylamide | CHEMBL349088
TypeSmall organic molecule
Emp. Form.C21H18BrCl3N4O
Mol. Mass.528.657
SMILESClc1ccc(cc1)-c1c(Br)c(nn1-c1ccc(Cl)cc1Cl)C(=O)NN1CCCCC1