Reaction Details
TargetCannabinoid receptor 1
LigandBDBM50123694
Substrate/Competitorn/a
Meas. Tech.ChEMBL_46640 (CHEMBL658896)
Ki 104±n/a nM
Citation Katoch-Rouse, RPavlova, OACaulder, THoffman, AFMukhin, AGHorti, AG Synthesis, structure-activity relationship, and evaluation of SR141716 analogues: development of central cannabinoid receptor ligands with lower lipophilicity. J Med Chem46:642-5 (2003) 
 
Cannabinoid receptor 1
Name:Cannabinoid receptor 1
Type:G Protein-Coupled Receptor (GPCR)
Mol. Mass.:52856.55
Organism:Rattus norvegicus (rat)
Description:P20272
Residue:473
BDBM50123694
NameBDBM50123694
Synonyms:1-(2,4-Dichloro-phenyl)-5-(4-hydroxy-phenyl)-4-methyl-1H-pyrazole-3-carboxylic acid piperidin-1-ylamide | CHEMBL157201
TypeSmall organic molecule
Emp. Form.C22H22Cl2N4O2
Mol. Mass.445.342
SMILESCc1c(nn(c1-c1ccc(O)cc1)-c1ccc(Cl)cc1Cl)C(=O)NN1CCCCC1