Reaction Details
TargetNeuropeptide Y receptor type 5
LigandBDBM50123735
Substrate/Competitorn/a
Meas. Tech.ChEMBL_144130 (CHEMBL750103)
Ki 33±n/a nM
Citation Sato, NTakahashi, TShibata, THaga, YSakuraba, AHirose, MSato, MNonoshita, KKoike, YKitazawa, HFujino, NIshii, YIshihara, AKanatani, AFukami, T Design and synthesis of the potent, orally available, brain-penetrable arylpyrazole class of neuropeptide Y5 receptor antagonists. J Med Chem46:666-9 (2003) 
 
Neuropeptide Y receptor type 5
Name:Neuropeptide Y receptor type 5
Type:Enzyme
Mol. Mass.:50746.64
Organism:Homo sapiens (Human)
Description:Q15761
Residue:445
BDBM50123735
NameBDBM50123735
Synonyms:CHEMBL160443 | Indan-2-carboxylic acid [5-(3,4-dimethoxy-phenyl)-1H-pyrazol-3-yl]-amide
TypeSmall organic molecule
Emp. Form.C21H21N3O3
Mol. Mass.363.4097
SMILESCOc1ccc(cc1OC)-c1cc(NC(=O)C2Cc3ccccc3C2)[nH]n1