Reaction Details
TargetProtein phosphatase 3 catalytic subunit alpha
LigandBDBM50123747
Substrate/Competitorn/a
Meas. Tech.ChEMBL_42588 (CHEMBL653182)
IC50 363±n/a nM
Citation Lazarova, TChen, JSHamann, BKang, JMHomuth-Trombino, DHan, FHoffmann, EMcClure, CEckstein, JOr, YS Synthesis and biological evaluation of novel cyclosporin a analogues: potential soft drugs for the treatment of autoimmune diseases. J Med Chem46:674-6 (2003) 
 
Protein phosphatase 3 catalytic subunit alpha
Name:Protein phosphatase 3 catalytic subunit alpha
Type:Enzyme Catalytic Domain
Mol. Mass.:58681.14
Organism:Homo sapiens (Human)
Description:calcineurin 0 HUMAN::Q08209
Residue:521
BDBM50123747
NameBDBM50123747
Synonyms:6-(5-Ethyl-11,17,26,29-tetraisobutyl-14,32-diisopropyl-1,7,10,16,20,23,25,28,31-nonamethyl-3,6,9,12,15,18,21,24,27,30,33-undecaoxo-1,4,7,10,13,16,19,22,25,28,31undecaaza-cyclotritriacont-2-yl)-6-hydroxy-5-methyl-hex-2-enoic acid ethyl ester | CHEMBL269260
TypeSmall organic molecule
Emp. Form.C64H113N11O14
Mol. Mass.1260.6473
SMILESCCOC(=O)\C=C\C[C@@H](C)[C@@H](O)[C@@H]1N(C)C(=O)[C@@H](C(C)C)N(C)C(=O)[C@H](CC(C)C)N(C)C(=O)[C@H](CC(C)C)N(C)C(=O)[C@H](C)NC(=O)[C@@H](C)NC(=O)[C@@H](CC(C)C)N(C)C(=O)[C@@H](NC(=O)[C@H](CC(C)C)N(C)C(=O)CN(C)C(=O)[C@@H](CC)NC1=O)C(C)C