Reaction Details
TargetCoagulation factor X
LigandBDBM50123778
Substrate/Competitorn/a
Meas. Tech.ChEMBL_48660 (CHEMBL657275)
Ki 8±n/a nM
Citation Choi-Sledeski, YMKearney, RPoli, GPauls, HGardner, CGong, YBecker, MDavis, RSpada, ALiang, GChu, VBrown, KCollussi, DLeadley, RRebello, SMoxey, PMorgan, SBentley, RKasiewski, CMaignan, SGuilloteau, JPMikol, V Discovery of an orally efficacious inhibitor of coagulation factor Xa which incorporates a neutral P1 ligand. J Med Chem46:681-4 (2003) 
 
Coagulation factor X
Name:Coagulation factor X
Type:Enzyme
Mol. Mass.:54726.60
Organism:Homo sapiens (Human)
Description:n/a
Residue:488
BDBM50123778
NameBDBM50123778
Synonyms:2-{2-[4-(6-Chloro-benzo[b]thiophene-2-sulfonyl)-2-oxo-piperazin-1-ylmethyl]-pyrrolo[3,2-c]pyridin-1-yl}-acetamide | CHEMBL422365
TypeSmall organic molecule
Emp. Form.C22H20ClN5O4S2
Mol. Mass.518.008
SMILESNC(=O)Cn1c(CN2CCN(CC2=O)S(=O)(=O)c2cc3ccc(Cl)cc3s2)cc2cnccc12