Reaction Details
TargetCoagulation factor X
LigandBDBM12596
Substrate/Competitorn/a
Meas. Tech.ChEMBL_48662 (CHEMBL657277)
Ki 1.1±n/a nM
Citation Choi-Sledeski, YMKearney, RPoli, GPauls, HGardner, CGong, YBecker, MDavis, RSpada, ALiang, GChu, VBrown, KCollussi, DLeadley, RRebello, SMoxey, PMorgan, SBentley, RKasiewski, CMaignan, SGuilloteau, JPMikol, V Discovery of an orally efficacious inhibitor of coagulation factor Xa which incorporates a neutral P1 ligand. J Med Chem46:681-4 (2003) 
 
Coagulation factor X
Name:Coagulation factor X
Type:Enzyme
Mol. Mass.:54726.60
Organism:Homo sapiens (Human)
Description:n/a
Residue:488
BDBM12596
NameBDBM12596
Synonyms:4-{[(E)-2-(5-CHLOROTHIEN-2-YL)VINYL]SULFONYL}-1-(1H-PYRROLO[3,2-C]PYRIDIN-2-YLMETHYL)PIPERAZIN-2-ONE CHEMBL423417 RPR209685
TypeSmall organic molecule
Emp. Form.C18H17ClN4O3S2
Mol. Mass.436.936
SMILESClc1ccc(C=CS(=O)(=O)N2CCN(Cc3cc4cnccc4[nH]3)C(=O)C2)s1