Reaction Details
TargetGlutamate receptor ionotropic, NMDA 1
LigandBDBM50123790
Substrate/Competitorn/a
Meas. Tech.ChEMBL_140539 (CHEMBL748767)
Ki 1±n/a nM
Citation Katayama, SAe, NKodo, TMasumoto, SHourai, STamamura, CTanaka, HNagata, R Tricyclic indole-2-carboxylic acids: highly in vivo active and selective antagonists for the glycine binding site of the NMDA receptor. J Med Chem46:691-701 (2003) 
 
Glutamate receptor ionotropic, NMDA 1
Name:Glutamate receptor ionotropic, NMDA 1
Type:Enzyme Catalytic Domain
Mol. Mass.:105533.40
Organism:RAT
Description:P35439
Residue:938
BDBM50123790
NameBDBM50123790
Synonyms:3-{[4-Aminomethyl-2-(1-carboxy-ethyl)-phenylcarbamoyl]-methyl}-7-chloro-1,3,4,5-tetrahydro-benzo[cd]indole-2-carboxylic acid | CHEMBL349136
TypeSmall organic molecule
Emp. Form.C24H24ClN3O5
Mol. Mass.469.917
SMILESC[C@@H](C(O)=O)c1cc(CN)ccc1NC(=O)C[C@@H]1CCc2cc(Cl)cc3[nH]c(C(O)=O)c1c23