Reaction Details
TargetReverse transcriptase/RNaseH
LigandBDBM50123889
Substrate/Competitorn/a
Meas. Tech.ChEMBL_104172 (CHEMBL714209)
EC50 58000±n/a nM
Citation Ranise, ASpallarossa, ASchenone, SBruno, OBondavalli, FVargiu, LMarceddu, TMura, MLa Colla, PPani, A Design, synthesis, SAR, and molecular modeling studies of acylthiocarbamates: a novel series of potent non-nucleoside HIV-1 reverse transcriptase inhibitors structurally related to phenethylthiazolylthiourea derivatives. J Med Chem46:768-81 (2003) 
 
Reverse transcriptase/RNaseH
Name:Reverse transcriptase/RNaseH
Type:PROTEIN
Mol. Mass.:65229.15
Organism:Human immunodeficiency virus 1
Description:ChEMBL_1473730
Residue:566
BDBM50123889
NameBDBM50123889
Synonyms:CHEMBL164697 | Phenyl-(tetrahydro-furan-2-carbonyl)-thiocarbamic acid O-benzyl ester
TypeSmall organic molecule
Emp. Form.C19H19NO3S
Mol. Mass.341.424
SMILESO=C(C1CCCO1)N(C(=S)OCc1ccccc1)c1ccccc1