Reaction Details
TargetReverse transcriptase/RNaseH
LigandBDBM50123912
Substrate/Competitorn/a
Meas. Tech.ChEMBL_104172 (CHEMBL714209)
EC50 6000±n/a nM
Citation Ranise, ASpallarossa, ASchenone, SBruno, OBondavalli, FVargiu, LMarceddu, TMura, MLa Colla, PPani, A Design, synthesis, SAR, and molecular modeling studies of acylthiocarbamates: a novel series of potent non-nucleoside HIV-1 reverse transcriptase inhibitors structurally related to phenethylthiazolylthiourea derivatives. J Med Chem46:768-81 (2003) 
 
Reverse transcriptase/RNaseH
Name:Reverse transcriptase/RNaseH
Type:PROTEIN
Mol. Mass.:65229.15
Organism:Human immunodeficiency virus 1
Description:ChEMBL_1473730
Residue:566
BDBM50123912
NameBDBM50123912
Synonyms:(4-Nitro-phenyl)-(thiophene-2-carbonyl)-thiocarbamic acid O-(1-methyl-2-phenoxy-ethyl) ester | CHEMBL354267
TypeSmall organic molecule
Emp. Form.C21H18N2O5S2
Mol. Mass.442.508
SMILESCC(COc1ccccc1)OC(=S)N(C(=O)c1cccs1)c1ccc(cc1)[N+]([O-])=O