Reaction Details
TargetReverse transcriptase/RNaseH
LigandBDBM50123884
Substrate/Competitorn/a
Meas. Tech.ChEMBL_104172 (CHEMBL714209)
EC50 4300±n/a nM
Citation Ranise, ASpallarossa, ASchenone, SBruno, OBondavalli, FVargiu, LMarceddu, TMura, MLa Colla, PPani, A Design, synthesis, SAR, and molecular modeling studies of acylthiocarbamates: a novel series of potent non-nucleoside HIV-1 reverse transcriptase inhibitors structurally related to phenethylthiazolylthiourea derivatives. J Med Chem46:768-81 (2003) 
 
Reverse transcriptase/RNaseH
Name:Reverse transcriptase/RNaseH
Type:PROTEIN
Mol. Mass.:65229.15
Organism:Human immunodeficiency virus 1
Description:ChEMBL_1473730
Residue:566
BDBM50123884
NameBDBM50123884
Synonyms:(Furan-2-carbonyl)-phenyl-thiocarbamic acid O-phenethyl ester | CHEMBL165287
TypeSmall organic molecule
Emp. Form.C20H17NO3S
Mol. Mass.351.419
SMILESO=C(N(C(=S)OCCc1ccccc1)c1ccccc1)c1ccco1